subscriber-n
type: LexicalEntry
canonical form: subscriber
sense: 10689749-n
part of speech: noun

contributor-n
type: LexicalEntry
canonical form: contributor
sense: 10689749-n
part of speech: noun

10689749-n
type: LexicalConcept
in scheme: en-word.net
definition: someone who contributes (or promises to contribute) a sum of money
ili: i93407
lexfile: noun.person
part of speech: noun
hypernym: 10045455-n