double-n
type: LexicalEntry
canonical form: double
sense: 10686285-n
part of speech: noun

10686285-n
type: LexicalConcept
in scheme: en-word.net
definition: a stand-in for movie stars to perform dangerous stunts
example: his first job in Hollywood was as a double for Clark Gable
ili: i93388
lexfile: noun.person
part of speech: noun
hypernym: 10667676-n