square-n
type: LexicalEntry
canonical form: square
sense: 10662386-n
part of speech: noun

lame-n
type: LexicalEntry
canonical form: lame
sense: 10662386-n
part of speech: noun

10662386-n
type: LexicalConcept
in scheme: en-word.net
definition: someone who doesn't understand what is going on
ili: i93247
lexfile: noun.person
part of speech: noun
hypernym: 10618762-n