speaker-n
type: LexicalEntry
canonical form: speaker
sense: 10650671-n
part of speech: noun

10650671-n
type: LexicalConcept
in scheme: en-word.net
definition: the presiding officer of a deliberative assembly
example: the leader of the majority party is the Speaker of the House of Representatives
ili: i93182
lexfile: noun.person
part of speech: noun
hypernym: 10488931-n