slicker-n
type: LexicalEntry
canonical form: slicker
sense: 10631385-n
part of speech: noun

10631385-n
type: LexicalConcept
in scheme: en-word.net
definition: a person with good manners and stylish clothing
ili: i93070
lexfile: noun.person
part of speech: noun
hypernym: 10644647-n