scout-n
type: LexicalEntry
canonical form: scout
sense: 10582396-n
part of speech: noun

talent scout-n
type: LexicalEntry
canonical form: talent scout
sense: 10582396-n
part of speech: noun

10582396-n
type: LexicalConcept
in scheme: en-word.net
definition: someone employed to discover and recruit talented persons (especially in the worlds of entertainment or sports)
ili: i92779
lexfile: noun.person
part of speech: noun
domain topic: 00524569-n
hypernym: 10532301-n