saint-n
type: LexicalEntry
canonical form: saint
sense: 10566702-n
part of speech: noun

10566702-n
type: LexicalConcept
in scheme: en-word.net
definition: a person who has died and has been declared a saint by canonization
ili: i92688
lexfile: noun.person
part of speech: noun
hypernym: 09528550-n