referee-n
type: LexicalEntry
canonical form: referee
sense: 10534236-n
part of speech: noun

10534236-n
type: LexicalConcept
in scheme: en-word.net
definition: an attorney appointed by a court to investigate and report on a case
ili: i92493
lexfile: noun.person
part of speech: noun
domain topic: 08458195-n
hypernym: 10269647-n