referee-n
type: LexicalEntry
canonical form: referee
sense: 10534022-n
part of speech: noun

ref-n
type: LexicalEntry
canonical form: ref
sense: 10534022-n
part of speech: noun

10534022-n
type: LexicalConcept
in scheme: en-word.net
definition: (sports) the chief official (as in boxing or American football) who is expected to ensure fair play
ili: i92492
lexfile: noun.person
part of speech: noun
domain topic: 00524569-n
hypernym: 10391775-n