proofreader-n
type: LexicalEntry
canonical form: proofreader
sense: 10502353-n
part of speech: noun

reader-n
type: LexicalEntry
canonical form: reader
sense: 10502353-n
part of speech: noun

10502353-n
type: LexicalConcept
in scheme: en-word.net
definition: someone who reads proof in order to find errors and mark corrections
ili: i92294
lexfile: noun.person
part of speech: noun
hypernym: 10494882-n