professional-n
type: LexicalEntry
canonical form: professional
sense: 10499838-n
part of speech: noun

professional person-n
type: LexicalEntry
canonical form: professional person
sense: 10499838-n
part of speech: noun

10499838-n
type: LexicalConcept
in scheme: en-word.net
definition: a person engaged in one of the learned professions
ili: i92281
lexfile: noun.person
part of speech: noun
hypernym: 09786620-n