principal-n
type: LexicalEntry
canonical form: principal
sense: 10494031-n
part of speech: noun

dealer-n
type: LexicalEntry
canonical form: dealer
sense: 10494031-n
part of speech: noun

10494031-n
type: LexicalConcept
in scheme: en-word.net
definition: the major party to a financial transaction at a stock exchange; buys and sells for their own account
ili: i92249
lexfile: noun.person
part of speech: noun
hypernym: 10109789-n