pilot-n
type: LexicalEntry
canonical form: pilot
sense: 10452928-n
part of speech: noun

airplane pilot-n
type: LexicalEntry
canonical form: airplane pilot
sense: 10452928-n
part of speech: noun

10452928-n
type: LexicalConcept
in scheme: en-word.net
definition: someone who is licensed to operate an aircraft in flight
ili: i92029
lexfile: noun.person
part of speech: noun
domain topic: 02689427-n
hypernym: 09845606-n