peasant-n
type: LexicalEntry
canonical form: peasant
sense: 10430741-n
part of speech: noun

10430741-n
type: LexicalConcept
in scheme: en-word.net
definition: one of a (chiefly European) class of agricultural laborers
ili: i91926
lexfile: noun.person
part of speech: noun
hypernym: 09799064-n