pallbearer-n
type: LexicalEntry
canonical form: pallbearer
sense: 10414772-n
part of speech: noun

bearer-n
type: LexicalEntry
canonical form: bearer
sense: 10414772-n
part of speech: noun

10414772-n
type: LexicalConcept
in scheme: en-word.net
definition: one of the mourners carrying the coffin at a funeral
ili: i91830
lexfile: noun.person
part of speech: noun
hypernym: 10354959-n