agent-n
type: LexicalEntry
canonical form: agent
sense: 10393500-n
part of speech: noun

federal agent-n
type: LexicalEntry
canonical form: federal agent
sense: 10393500-n
part of speech: noun

10393500-n
type: LexicalConcept
in scheme: en-word.net
definition: any agent or representative of a federal agency or bureau
ili: i91711
lexfile: noun.person
part of speech: noun
hypernym: 10392072-n