occupier-n
type: LexicalEntry
canonical form: occupier
sense: 10389654-n
part of speech: noun

10389654-n
type: LexicalConcept
in scheme: en-word.net
definition: a member of a military force who is residing in a conquered foreign country
ili: i91693
lexfile: noun.person
part of speech: noun
domain topic: 08215965-n
hypernym: 10602198-n