neuroscientist-n
type: LexicalEntry
canonical form: neuroscientist
sense: 10374279-n
part of speech: noun

10374279-n
type: LexicalConcept
in scheme: en-word.net
definition: a neurobiologist who specializes in the study of the brain
ili: i91594
lexfile: noun.person
part of speech: noun
hypernym: 10373627-n