mouth-n
type: LexicalEntry
canonical form: mouth
sense: 10355392-n
part of speech: noun

10355392-n
type: LexicalConcept
in scheme: en-word.net
definition: a person conceived as a consumer of food
example: he has four mouths to feed
ili: i91483
lexfile: noun.person
part of speech: noun
hypernym: 10062108-n