material-n
type: LexicalEntry
canonical form: material
sense: 10320321-n
part of speech: noun

10320321-n
type: LexicalConcept
in scheme: en-word.net
definition: a person judged suitable for admission or employment
example: he was university material
example: she was vice-presidential material
ili: i91261
lexfile: noun.person
part of speech: noun
hypernym: 09630310-n