master-n
type: LexicalEntry
canonical form: master
sense: 10318149-n
part of speech: noun

professional-n
type: LexicalEntry
canonical form: professional
sense: 10318149-n
part of speech: noun

10318149-n
type: LexicalConcept
in scheme: en-word.net
definition: an authority qualified to teach apprentices
ili: i91248
lexfile: noun.person
part of speech: noun
hypernym: 09843763-n