lector-n
type: LexicalEntry
canonical form: lector
sense: 10272051-n
part of speech: noun

reader-n
type: LexicalEntry
canonical form: reader
sense: 10272051-n
part of speech: noun

10272051-n
type: LexicalConcept
in scheme: en-word.net
definition: someone who reads the lessons in a church service; someone ordained in a minor order of the Roman Catholic Church
ili: i90961
lexfile: noun.person
part of speech: noun
hypernym: 09946909-n
hypernym: 13974030-n