laugher-n
type: LexicalEntry
canonical form: laugher
sense: 10268573-n
part of speech: noun

10268573-n
type: LexicalConcept
in scheme: en-word.net
definition: a person who is laughing or who laughs easily
ili: i90942
lexfile: noun.person
part of speech: noun
hypernym: 09786620-n