knight-n
type: LexicalEntry
canonical form: knight
sense: 10258072-n
part of speech: noun

10258072-n
type: LexicalConcept
in scheme: en-word.net
definition: originally a person of noble birth trained to arms and chivalry; today in Great Britain a person honored by the sovereign for personal merit
ili: i90874
lexfile: noun.person
part of speech: noun
hypernym: 10304832-n