jazz musician-n
type: LexicalEntry
canonical form: jazz musician
sense: 10240156-n
part of speech: noun

10240156-n
type: LexicalConcept
in scheme: en-word.net
definition: a musician who plays or composes jazz music
ili: i90778
lexfile: noun.person
part of speech: noun
hypernym: 10360025-n