interpreter-n
type: LexicalEntry
canonical form: interpreter
sense: 10232450-n
part of speech: noun

10232450-n
type: LexicalConcept
in scheme: en-word.net
definition: someone who uses art to represent something
example: his paintings reveal a sensitive interpreter of nature
example: she was famous as an interpreter of Shakespearean roles
ili: i90734
lexfile: noun.person
part of speech: noun
hypernym: 09786620-n