infiltrator-n
type: LexicalEntry
canonical form: infiltrator
sense: 10225452-n
part of speech: noun

10225452-n
type: LexicalConcept
in scheme: en-word.net
definition: someone who takes up a position surreptitiously for the purpose of espionage
ili: i90694
lexfile: noun.person
part of speech: noun
hypernym: 10661153-n