humanist-n
type: LexicalEntry
canonical form: humanist
sense: 10211007-n
part of speech: noun

humanitarian-n
type: LexicalEntry
canonical form: humanitarian
sense: 10211007-n
part of speech: noun

10211007-n
type: LexicalConcept
in scheme: en-word.net
definition: an advocate of the principles of humanism; someone concerned with the interests and welfare of humans
ili: i90611
lexfile: noun.person
part of speech: noun
hypernym: 09794206-n