host-n
type: LexicalEntry
canonical form: host
sense: 10206975-n
part of speech: noun

10206975-n
type: LexicalConcept
in scheme: en-word.net
definition: (medicine) recipient of transplanted tissue or organ from a donor
ili: i90581
lexfile: noun.person
part of speech: noun
domain topic: 06052606-n
hypernym: 09651094-n