honker-n
type: LexicalEntry
canonical form: honker
sense: 10203175-n
part of speech: noun

10203175-n
type: LexicalConcept
in scheme: en-word.net
definition: a driver who causes their car's horn to make a loud honking sound
example: the honker was fined for disturbing the peace
ili: i90555
lexfile: noun.person
part of speech: noun
hypernym: 10054631-n