handler-n
type: LexicalEntry
canonical form: handler
sense: 10178201-n
part of speech: noun

10178201-n
type: LexicalConcept
in scheme: en-word.net
definition: an agent who handles something or someone
example: the senator's campaign handlers
ili: i90399
lexfile: noun.person
part of speech: noun
hypernym: 09796794-n