guide-n
type: LexicalEntry
canonical form: guide
sense: 10171090-n
part of speech: noun

10171090-n
type: LexicalConcept
in scheme: en-word.net
definition: someone who shows the way by leading or advising
ili: i90354
lexfile: noun.person
part of speech: noun
hypernym: 09646208-n