frump-n
type: LexicalEntry
canonical form: frump
sense: 10133978-n
part of speech: noun

dog-n
type: LexicalEntry
canonical form: dog
sense: 10133978-n
part of speech: noun

10133978-n
type: LexicalConcept
in scheme: en-word.net
definition: a dull unattractive unpleasant girl or woman
example: she got a reputation as a frump
example: she's a real dog
ili: i90107
lexfile: noun.person
part of speech: noun
exemplifies: 06730109-n
hypernym: 09654651-n