boss-n
type: LexicalEntry
canonical form: boss
sense: 10123833-n
part of speech: noun

10123833-n
type: LexicalConcept
in scheme: en-word.net
definition: a person who exercises control and makes decisions
example: he is his own boss now
ili: i90041
lexfile: noun.person
part of speech: noun
hypernym: 09646208-n