foreign minister-n
type: LexicalEntry
canonical form: foreign minister
sense: 10123563-n
part of speech: noun

secretary of state-n
type: LexicalEntry
canonical form: secretary of state
sense: 10123563-n
part of speech: noun

10123563-n
type: LexicalConcept
in scheme: en-word.net
definition: a government minister for foreign relations
ili: i90039
lexfile: noun.person
part of speech: noun
hypernym: 10340521-n