finder-n
type: LexicalEntry
canonical form: finder
sense: 10110514-n
part of speech: noun

10110514-n
type: LexicalConcept
in scheme: en-word.net
definition: someone who comes upon something after searching
ili: i89953
lexfile: noun.person
part of speech: noun
hypernym: 10595231-n