film director-n
type: LexicalEntry
canonical form: film director
sense: 10107969-n
part of speech: noun

director-n
type: LexicalEntry
canonical form: director
sense: 10107969-n
part of speech: noun

10107969-n
type: LexicalConcept
in scheme: en-word.net
definition: the person who directs the making of a film
ili: i89945
lexfile: noun.person
part of speech: noun
hypernym: 10108159-n