endorser-n
type: LexicalEntry
canonical form: endorser
sense: 10077079-n
part of speech: noun

indorser-n
type: LexicalEntry
canonical form: indorser
sense: 10077079-n
part of speech: noun

10077079-n
type: LexicalConcept
in scheme: en-word.net
definition: a person who transfers their ownership interest in something by signing a check or negotiable security
ili: i89757
lexfile: noun.person
part of speech: noun
hypernym: 10616642-n