Egyptologist-n
type: LexicalEntry
canonical form: Egyptologist
sense: 10067630-n
part of speech: noun

10067630-n
type: LexicalConcept
in scheme: en-word.net
definition: an archeologist who specializes in Egyptology
ili: i89701
lexfile: noun.person
part of speech: noun
hypernym: 09824229-n