crimp-n
type: LexicalEntry
canonical form: crimp
sense: 09998096-n
part of speech: noun

crimper-n
type: LexicalEntry
canonical form: crimper
sense: 09998096-n
part of speech: noun

09998096-n
type: LexicalConcept
in scheme: en-word.net
definition: someone who tricks or coerces men into service as sailors or soldiers
ili: i89311
lexfile: noun.person
part of speech: noun
exemplifies: 06730109-n
hypernym: 10250498-n