center-n
type: LexicalEntry
canonical form: center
sense: 09924009-n
part of speech: noun

centre-n
type: LexicalEntry
canonical form: centre
sense: 09924009-n
part of speech: noun

09924009-n
type: LexicalConcept
in scheme: en-word.net
definition: (basketball) the person who plays center on a basketball team
ili: i88889
lexfile: noun.person
part of speech: noun
domain topic: 00482004-n
hypernym: 09861435-n