catch-n
type: LexicalEntry
canonical form: catch
sense: 09920434-n
part of speech: noun

match-n
type: LexicalEntry
canonical form: match
sense: 09920434-n
part of speech: noun

09920434-n
type: LexicalConcept
in scheme: en-word.net
definition: a person regarded as a good matrimonial prospect
ili: i88866
lexfile: noun.person
part of speech: noun
hypernym: 09786620-n