bear-n
type: LexicalEntry
canonical form: bear
sense: 09864599-n
part of speech: noun

09864599-n
type: LexicalConcept
in scheme: en-word.net
definition: an investor with a pessimistic market outlook; an investor who expects prices to fall and so sells now in order to buy later at a lower price
ili: i88502
lexfile: noun.person
part of speech: noun
hypernym: 10235776-n