bacchant-n
type: LexicalEntry
canonical form: bacchant
sense: 09849044-n
part of speech: noun

bacchanal-n
type: LexicalEntry
canonical form: bacchanal
sense: 09849044-n
part of speech: noun

09849044-n
type: LexicalConcept
in scheme: en-word.net
definition: a drunken reveller; a devotee of Bacchus
ili: i88392
lexfile: noun.person
part of speech: noun
hypernym: 10097373-n