aggravator-n
type: LexicalEntry
canonical form: aggravator
sense: 09797978-n
part of speech: noun

annoyance-n
type: LexicalEntry
canonical form: annoyance
sense: 09797978-n
part of speech: noun

09797978-n
type: LexicalConcept
in scheme: en-word.net
definition: an unpleasant person who is annoying or exasperating
ili: i88120
lexfile: noun.person
part of speech: noun
exemplifies: 06730109-n
hypernym: 09654651-n