agent-n
type: LexicalEntry
canonical form: agent
sense: 09796794-n
part of speech: noun

09796794-n
type: LexicalConcept
in scheme: en-word.net
definition: a representative who acts on behalf of other persons or organizations
ili: i88114
lexfile: noun.person
part of speech: noun
hypernym: 10541628-n