Christian-n
type: LexicalEntry
canonical form: Christian
sense: 09697405-n
part of speech: noun

09697405-n
type: LexicalConcept
in scheme: en-word.net
definition: a religious person who believes Jesus is the Christ and who is a member of a Christian denomination
ili: i87503
lexfile: noun.person
part of speech: noun
hypernym: 09651570-n