national-n
type: LexicalEntry
canonical form: national
sense: 09648571-n
part of speech: noun

subject-n
type: LexicalEntry
canonical form: subject
sense: 09648571-n
part of speech: noun

09648571-n
type: LexicalConcept
in scheme: en-word.net
definition: a person who owes allegiance to that nation
example: a monarch has a duty to his subjects
ili: i87232
lexfile: noun.person
part of speech: noun
hypernym: 09786620-n