benefactor-n
type: LexicalEntry
canonical form: benefactor
sense: 09631739-n
part of speech: noun

helper-n
type: LexicalEntry
canonical form: helper
sense: 09631739-n
part of speech: noun

09631739-n
type: LexicalConcept
in scheme: en-word.net
definition: a person who helps people or institutions (especially with financial help)
ili: i87166
lexfile: noun.person
part of speech: noun
hypernym: 10158287-n