appointee-n
type: LexicalEntry
canonical form: appointee
sense: 09630660-n
part of speech: noun

appointment-n
type: LexicalEntry
canonical form: appointment
sense: 09630660-n
part of speech: noun

09630660-n
type: LexicalConcept
in scheme: en-word.net
definition: a person who is appointed to a job or position
ili: i87160
lexfile: noun.person
part of speech: noun
hypernym: 09786620-n